FREEDOM. FRIENDS. FEATURES. FIRST.
페도라 한국 사용자 모임

'modutils 2.4.3 을 설치하고 있는데 make 과정에서 오류가 납니다.'에 답변달기

게시판 질문게시판 modutils 2.4.3 을 설치하고 있는데 make 과정에서 오류가 납니다. 'modutils 2.4.3 을 설치하고 있는데 make 과정에서 오류가 납니다.'에 답변달기

#15411
둥둥이
참가자
참가자
  • 게시글41
  • 댓글32
  • 총합73
  • ★★
@seojh1431

답변 감사합니다 태랑님 하지만 yum 으로 glibc를 설치해주었는데도 오류 메시지는 그대로인 것 같습니다 ㅜㅜ


make[1]: Entering directory `/usr/src/modutils-2.4.3/util'
gcc -O2 -Wall -I./../include -D_GNU_SOURCE  -DCONFIG_ROOT_CHECK_OFF=0  -DELF_MACHINE_H='"elf_i386.h"' -DARCH_i386  -c -o modstat.o modstat.c
In file included from modstat.c:33:
./../include/util.h:44: warning: built-in function ‘log’ declared as non-function
modstat.c: In function ‘new_get_kernel_info’:
modstat.c:202: error: label at end of compound statement
make[1]: *** [modstat.o] 오류 1
make[1]: Leaving directory `/usr/src/modutils-2.4.3/util'
make[1]: Entering directory `/usr/src/modutils-2.4.3/obj'
gcc -O2 -Wall -I./../include -D_GNU_SOURCE  -DCONFIG_ROOT_CHECK_OFF=0   -DELF_MACHINE_H='"elf_i386.h"' -DARCH_i386 -c -o obj_kallsyms.o obj_kallsyms.c
In file included from obj_kallsyms.c:28:
./../include/util.h:44: warning: built-in function ‘log’ declared as non-function
obj_kallsyms.c: In function ‘obj_kallsyms’:
obj_kallsyms.c:206: error: lvalue required as left operand of assignment
obj_kallsyms.c:281: error: lvalue required as left operand of assignment
make[1]: *** [obj_kallsyms.o] 오류 1
make[1]: Leaving directory `/usr/src/modutils-2.4.3/obj'
make[1]: Entering directory `/usr/src/modutils-2.4.3/insmod'
make[1]: *** `insmod'에서 필요로 하는  타겟 `../obj/libobj.a'를 만들 규칙이 없습니다.  멈춤.
make[1]: Leaving directory `/usr/src/modutils-2.4.3/insmod'
make[1]: Entering directory `/usr/src/modutils-2.4.3/genksyms'