FREEDOM. FRIENDS. FEATURES. FIRST.
페도라 한국 사용자 모임

'modutils 2.4.3 을 설치하고 있는데 make 과정에서 오류가 납니다.'에 답변달기

게시판 질문게시판 modutils 2.4.3 을 설치하고 있는데 make 과정에서 오류가 납니다. 'modutils 2.4.3 을 설치하고 있는데 make 과정에서 오류가 납니다.'에 답변달기

#15412
둥둥이
참가자
참가자
  • 게시글41
  • 댓글32
  • 총합73
  • ★★
@seojh1431

이어서..

gcc -O2 -Wall -I. -I. -I./../include -D_GNU_SOURCE  -DCONFIG_ROOT_CHECK_OFF=0   -c -o genksyms.o genksyms.c
In file included from genksyms.c:34:
./../include/util.h:44: warning: built-in function ‘log’ declared as non-function
genksyms.c:50: error: static declaration of ‘errors’ follows non-static declaration
./../include/util.h:45: note: previous declaration of ‘errors’ was here
make[1]: *** [genksyms.o] 오류 1
make[1]: Leaving directory `/usr/src/modutils-2.4.3/genksyms'
make[1]: Entering directory `/usr/src/modutils-2.4.3/depmod
make[1]: *** `depmod'에서 필요로 하는  타겟 `../util/libutil.a'를 만들 규칙이 없습니다.  멈춤.
make[1]: Leaving directory `/usr/src/modutils-2.4.3/depmod'
make: *** [all] 오류 2